{"text_format":"1","workbook":"xlsx","n_sheets":8,"sheets":["Instructivo","Estructura","Diagnóstico_RR","Formulas","Evaluacion funcion aseguramient","Mapa aseguramiento","Consolidado controles","Hoja2"],"not_rendered":{"charts":0,"images":5,"macros":1,"external_links":0,"defined_names":8,"comments":3,"pivot_tables":0},"unopened":[],"bounds":{"document_bytes":16777216,"sheet_cells":100000,"rows_first":2000,"rows_last":500,"rows_between":2000,"halvings":0,"cell_chars":16384,"cell_head_chars":4096},"cells_cut":0,"cells_raw":0,"read":"whole","date_system":"1900"}

{"sheet":"Instructivo","index":0,"n_rows":7,"n_cols":3,"rows_kept":7,"cut":false,"hidden":false,"merged":[[1,1,1,17],[3,1,3,17],[6,2,90,16]]}
[]
[null,"ESTRUCTURA LÍNEAS DE DEFENSA "]
[]
[null,"INSTRUCCIONES DE DILIGENCIAMIENTO"]
[]
[]
[null,null,"Este archivo hace parte de un conjunto de herramientas que le permitirán desarrollar un ejercicio de identificación del modelo de las líneas de defensa  con el propósito de que la entidad establezca e identifique las responsabilidades y roles que se distribuye a través de sus servidores frente a la gestión del riesgo y el control. Este instrumento se constituye como una guía para facilitar el proceso de estructuración de las líneas de defensa. \nEste archivo cuenta con cuatro (4) hojas de Excel de interés para quien lo diligencie, las cuales se explicaran a continuación:\n\nESTRUCTURA LÍNEAS DE DEFENSA:\n\nLa presentación de este archivo busca que el usuario conozca los conceptos básicos para desarrollar el ejercicio de líneas de defensa en su entidad.  Por esta razón, presenta la estructura de cada una de las líneas de defensa consideradas en este modelo a través de la descripción de sus integrantes y las responsabilidades generales ; dicha estructura corresponde a la presentada en el Manual Operativo del MIPG - Versión 2. \n\nDIAGNÓSTICO DE ROLES Y RESPONSABILIDADES:\n\nCorresponde al primer archivo que el usuario debe diligenciar, para ello debe tener en cuenta las siguientes consideraciones:\n\nAspectos claves de éxito: corresponden a los programas, proyectos, procesos, sistemas, entre otros de la entidad que agregan valor para el cumplimiento de los objetivos institucionales. El listado presentado corresponde a un ejemplo de algunos aspectos claves los cuales pueden ser modificados y ajustados a la operación de la entidad.  \n\nResponsables- Cargo: Corresponde a los posibles cargos que se pueden encontrar en una entidad. El listado presentado corresponde a un ejemplo de algunos cargos. \n\nModo de diligenciamiento: teniendo en cuenta los aspectos claves de éxito listados sobre las filas y los responsables listados sobre las columnas, se deben identificar los responsables sobre cada uno de los componentes de los aspectos claves. En la parte superior del archivo se presentan cuatro componentes (Planear, Aprobar, Ejecutar y Verificar) que deben ser ubicados en la casilla en la que se entrecruce un aspecto clave de éxito con un responsable. Cada componente asociado a un aspecto puede tener uno o más responsables por lo que puede estar ubicado en una o más casillas al mismo tiempo. \nA continuación se presenta un ejemplo de diligenciamiento: \n \nComo se evidencia en el ejemplo del aspecto clave de éxito de la gestión del talento humano, la responsabilidad sobre los cuatro componentes recae sobre 3 cargos de la siguiente manera:\nRepresentante legal: Aprua\nJefe de Oficina (quien en este caso puede ser el director o coordinador de talento humano) – Planea, Verifica y Ejecuta. \nProfesional – Ejecuta. \nEn el ejemplo, el jefe de oficina y el profesional llevan a cabo tareas de ejecución porque pueden ejecutar diferentes etapas asociadas a la gestión del talento humano. De la misma manera, en la práctica cada uno de los componentes (Planear, Verificar, Aprobar y Ejecutar) puede ser llevado a cabo por uno o más cargos o responsables.\n \nIDENTIFICACIÓN SEGUNDA LINEA DE DEFENSA \n\nEl archivo asociado a la identificación de la segunda línea de defensa tiene en cuenta los aspectos clave de éxito enunciados en el archivo de diagnóstico de roles y responsabilidades. El objetivo de este documento es identificar para cuales actividades de éxito existe una segunda línea de defensa y para cuáles no. \nEl diligenciamiento de cada una de las columnas del archivo se describe a continuación: \nAspectos clave de éxito: son los mismos aspectos clave enunciados en el archivo de roles y responsabilidades y sobre los cuales se evaluara la existencia de una segunda línea de defensa.\nRiesgo Asociado: para cada uno de los aspectos clave se deben identificar uno o más riesgos sobre los cuales se han establecido controles. \nResponsable: Al interior de la entidad debe haber uno o varios responsables sobre un aspecto clave de éxito. En esta casilla deben colocarse todos los responsables de los que se tenga conocimiento están asociados al aspecto clave de éxito. \nÁrea Funcional: Los responsables pertenecen a áreas funcionales por lo que se debe identificar las mismas. Por otro lado, existe la posibilidad de que no haya un responsable individual de un aspecto de éxito sino que dicha responsabilidad recaiga en un área funcional como un todo. En este caso, se debe identificar el área encargada. \n\nUna vez se identifiquen los aspectos clave de éxito, los riesgos asociados al mismo y los responsables del aspecto clave, se procede a identificar si estos pertenecen o no a la segunda línea de defensa. Para tales fines se debe dar respuesta a 3 preguntas que se definen como 3 criterios. \nCriterios para la identificación de la segunda línea de defensa: \n• ¿El responsable o área funcional encargada del aspecto clave de éxito pertenece a la Media o Alta Gerencia?\n• ¿El área funcional o responsable responde ante la Alta Dirección por el aspecto clave de éxito?\n• ¿El área funcional o responsable realiza actividades de seguimiento?\nEn caso de que la respuesta sea afirmativa, se debe colocar una X en la casilla asociada a cada una de las preguntas. \nClasificación: esta casilla se llena automáticamente una vez se responden los criterios para la identificación de la segunda línea de defensa. De esta manera, el usuario sabrá de inmediato si de acuerdo a las características identificadas el responsable pertenece a la primera o a la segunda línea de defensa. \nPara las actividades en las que la clasificación resulte en la primera línea de defensa no se debe seguir diligenciando el archivo. Por otro lado, aquellas actividades para las que se identifique una segunda línea de defensa deben diligenciar las columnas restantes. \nFunciones de aseguramiento: las funciones de aseguramiento son aquellas funciones que se llevan a cabo sobre los controles que se han establecido en la primera línea de defensa. Una función de aseguramiento tiene un carácter global a comparación de los controles que han sido establecidos de manera directa para el manejo de riesgos. \nCriterios evaluadores de la función de aseguramiento: Existen 4 criterios bajo los cuales se evalúa si una función de aseguramiento ha sido establecida de manera adecuada: \n• Establecimiento del objetivo y alcance de la función de aseguramiento. \n• Metodología establecida para la función de aseguramiento. \n• Si la función de aseguramiento cuenta con responsables claramente definidos. \n• Metodología para la comunicación de resultados y el manejo de información. \nEn la casilla asociada a cada uno de estos criterios el usuario debe colocar un numero entre 1 y 5 de acuerdo a como considere se lleve dicha tarea en su entidad. Una vez se han colocado los 4 valores, se obtendrá un total que determinará el nivel de confianza de aseguramiento provisto por la función descrita. Dicho nivel de confianza puede ser bajo, medio o alto. \nLas columnas no especificadas en este instructivo se diligencian de manera automática a medida que el usuario agrega información dentro del archivo. \n\nINTERPRETACIÓN NIVEL DE ASEGURAMIENTO\n\nEste archivo es de carácter informativo y se presenta con el objetivo de que el usuario pueda interpretar con mayor facilidad que quiere decir tener un nivel bajo, medio o alto de aseguramiento y cuáles son las implicaciones que dicha valoración puede traer y las acciones que se deben tomar. \n\nMAPA DE ASEGURAMIENTO \n\nEl mapa de aseguramiento busca consolidar la información de la segunda y tercera líneas de defensa de la entidad relacionando los aspectos clave de éxito, los riesgos asociados al mismo, sus responsables y áreas funcionales. \nLa información aquí consolidada proviene de los otros archivos que han sido previamente diligenciados. \n\n"]

{"sheet":"Estructura","index":1,"n_rows":10,"n_cols":4,"rows_kept":10,"cut":false,"hidden":false,"merged":[[0,1,1,1],[0,2,0,3],[1,2,1,3],[3,1,3,2]]}
[null,null,"ESTRUCTURA LÍNEAS DE DEFENSA "]
[]
[]
[]
[]
[null,"LÍNEAS DE DEFENSA ","INTEGRANTES ","RESPONSABILIDAD"]
[null,"Línea Estratégica","Alta Dirección y Comité Institucional de Coordinación de Control Interno.\n","Tendrá la responsabilidad de definir el marco general para la gestión del riesgo (política de administración del riesgo) y garantizar el cumplimiento de los planes de la entidad.\n\nAnaliza los riesgos y amenazas institucionales al cumplimiento del os planes estratégicos (objetivos, metas, indicadores)"]
[null,"Primera Línea de Defensa","Dependiendo de la estructura organizacional de la entidad (organigrama), Líderes de proceso y sus equipos (En general servidores públicos en todos los niveles de la organización).","Garantizan la gestión en el día a día, en conjunto con sus equipos de trabajo.\n\nSe encarga de identificar, evaluar, controlar y mitigar los riesgos.\n\nSon responsables de implementar acciones correctivas y detectar fallas en los controles."]
{"$rows_left_out":3}
{"sheet":"Diagnóstico_RR","index":2,"n_rows":267,"n_cols":5,"rows_kept":267,"cut":false,"hidden":true,"merged":[[241,0,248,0],[241,1,248,1],[250,0,257,0],[250,1,257,1],[259,0,266,0],[259,1,266,1],[214,0,221,0],[214,1,221,1],[223,0,230,0],[223,1,230,1],[232,0,239,0],[232,1,239,1],[187,0,194,0],[187,1,194,1],[196,0,203,0],[196,1,203,1],[205,0,212,0],[205,1,212,1],[160,0,167,0],[160,1,167,1],[169,0,176,0],[169,1,176,1],[178,0,185,0],[178,1,185,1],[115,0,122,0],[124,0,131,0],[133,0,140,0],[142,0,149,0],[151,0,158,0],[124,1,131,1],[133,1,140,1],[142,1,149,1],[151,1,158,1],[16,0,23,0],[25,0,32,0],[34,0,41,0],[43,0,50,0],[52,0,59,0],[61,0,68,0],[70,0,77,0],[79,0,86,0],[88,0,95,0],[97,0,104,0],[106,0,113,0],[79,1,86,1],[88,1,95,1],[97,1,104,1],[106,1,113,1],[115,1,122,1],[43,1,50,1],[52,1,59,1],[61,1,68,1],[70,1,77,1],[7,1,14,1],[7,0,14,0],[16,1,23,1],[25,1,32,1],[34,1,41,1],[4,4,5,4],[0,2,0,4],[1,2,1,4],[0,0,1,1],[2,0,2,4],[3,1,5,1],[3,2,3,4],[3,0,5,0],[4,2,5,2],[4,3,5,3]]}
[null,null,"DIAGNÓSTICO DE ROLES Y RESPONSABILIDADES"]
[null,null,{"$f":"Estructura!C2","v":0}]
["P: Planea o diseña la actividad     A: Aprueba la actividad o su salida (producto/servicio)    \nE: Ejecuta la actividad                     V: Verifica la actividad "]
["No. ","ASPECTO CLAVE DE ÉXITO\n(Programa, Proyecto, Proceso, Sistema, entre otros)","RESPONSABLE - CARGO"]
[null,null,"CARGO","AREA","COMPONENTE"]
[]
[]
[1,"Planeación Estratégica","Seleccione…",null,"Seleccione…"]
{"$rows_left_out":260}
{"sheet":"Formulas","index":3,"n_rows":18,"n_cols":2,"rows_kept":18,"cut":false,"hidden":true,"merged":[]}
["Opciones","Cargos"]
["Seleccione…","Seleccione…"]
["P","Representante Legal"]
["A","Secretario"]
["E","Director / Jefe de Oficina"]
["V","Coordinador"]
["P-A","Asesor"]
["P-E","Profesional"]
{"$rows_left_out":11}
{"sheet":"Evaluacion funcion aseguramient","index":4,"n_rows":32,"n_cols":20,"rows_kept":32,"cut":false,"hidden":false,"merged":[[0,3,3,17],[5,16,6,16],[5,17,6,17],[4,1,4,17],[5,11,5,15],[5,2,6,2],[5,1,6,1],[5,6,5,8],[5,3,6,3],[5,4,6,4],[5,5,6,5],[5,9,6,9],[0,1,3,2],[5,10,6,10],[0,18,0,20],[1,18,1,20],[2,18,2,20],[5,18,6,18],[4,19,6,19],[3,18,3,20]]}
[null,null,null,"\nMAPA DE ASEGURAMIENTO IDEP\n",null,null,null,null,null,null,null,null,null,null,null,null,null,null,"Código: FT-MIC-03-22"]
[null,null,null,null,null,null,null,null,null,null,null,null,null,null,null,null,null,null,"Versión: 2"]
[null,null,null,null,null,null,null,null,null,null,null,null,null,null,null,null,null,null,"Fecha Aprobación: 13/04/2022"]
[null,null,null,null,null,null,null,null,null,null,null,null,null,null,null,null,null,null,"Página: 1 de 3"]
[null,"SEGUNDA LÍNEA DE DEFENSA",null,null,null,null,null,null,null,null,null,null,null,null,null,null,null,null,null,"TERCERA LÍNEA DE DEFENSA\nPriorizar en el plan de auditoria"]
[null,"No. ","ASPECTO CLAVE DE ÉXITO\n(Programa, Proyecto, Proceso, Sistema, entre otros)","Riesgo asociado al aspecto clave de éxito","Responsable","Area Funcional","Criterios para la identificación de la segunda línea de defensa",null,null,"Clasificación ","Actividad de aseguramiento","CRITERIOS EVALUADORES DE LA FUNCIÓN DE ASEGURAMIENTO",null,null,null,null,"NIVEL DE \nCONFIANZA","OBSERVACIÓN NIVEL DE CONFIANZA","OBSERVACION OCI"]
[null,null,null,null,null,null,"¿Pertenece a la Media o Alta Gerencia?","¿Responde ante la Alta Dirección?","¿Realiza actividades de seguimiento?",null,null,"Objetivo y alcance de la funcion de aseguramiento\n(20%)","Prácticas y metodología\n(30%)","Ejecución por parte del responsable\n(30%)","Comunicación de resultados \n(20%)","Total"]
[{"$f":"CONCATENATE(J8,B8)","v":"Segunda Línea de Defensa1"},1,"Sub sistema de seguridad y salud en el trabajo","Posibillidad de daño reputacional por Incumplimiento  de los estándares mínimos del Sistema de Gestión de Seguridad y Salud en el Trabajo, debido a Deficiencias en la identificación de peligros, evaluación y valoración de los riesgos y en la implementación de controles y al ","Subdirector(a) Administrativo, Financiero y de Control Interno\nDisciplinario y\nContratista Profesional Francy ","Subdirección administrativa y financiera -  Proceso Gestión de Recursis fisicos.","x","X","x",{"$f":"IF(COUNTIF(G8:I8,\"X\")=3,\"Segunda Línea de Defensa\",IF(COUNTIF(G8:I8,\"X\")=2,\"Primera Línea de Defensa\",IF(COUNTIF(G8:I8,\"X\")=1,\"Primera Línea de Defensa\",)))","v":"Segunda Línea de Defensa"},"Seguimiento  y presentación de los resultados del Plan de Trabajo Anual de Seguridad y Salud en el Trabajo - SST en el comité Institucional de Gestión y Desempeño. ( semestral)",5,5,5,5,{"$f":"(L8*0.2)+(M8*0.3)+(N8*0.3)+(O8*0.2)","v":5},{"$f":"IF(P8<0.9,\" \",IF(P8<3,\"Bajo Aseguramiento\",IF(P8<4,\"Medio Aseguramiento\",\"Alto Aseguramiento\")))","v":"Alto Aseguramiento"},{"$f":"VLOOKUP(Q8,Hoja2!$I$3:$O$8,2,0)","v":"La Oficina de Control Interno o quien haga sus veces confiará en los resultados del aseguramiento de la 2ª línea y basado en sus informes, auditará la efectividad de dicha función, evitando evaluar los controles de la 1ª línea."},null,{"$f":"IFERROR(VLOOKUP(Q8,Hoja2!$I$9:$O$13,2,0),\" \")","v":" "}]
{"$rows_left_out":25}
{"sheet":"Mapa aseguramiento","index":5,"n_rows":13,"n_cols":23,"rows_kept":13,"cut":false,"hidden":false,"merged":[[5,22,6,22],[5,17,6,17],[5,9,5,11],[5,12,5,16],[5,7,6,7],[5,8,6,8],[5,18,6,18],[5,19,6,19],[5,1,6,1],[5,0,6,0],[5,6,6,6],[0,0,4,2],[0,3,4,16],[5,3,6,3],[5,4,6,4],[5,5,6,5],[0,17,0,19],[1,17,1,19],[2,17,3,19],[4,17,4,19],[5,2,6,2]]}
[null,null,null,"MAPA DE ASEGURAMIENTO IDEP",null,null,null,null,null,null,null,null,null,null,null,null,null,"Código: FT-MIC-03-22"]
[null,null,null,null,null,null,null,null,null,null,null,null,null,null,null,null,null,"Versión: 2"]
[null,null,null,null,null,null,null,null,null,null,null,null,null,null,null,null,null,"Fecha Aprobación: 13/04/2022"]
[]
[null,null,null,null,null,null,null,null,null,null,null,null,null,null,null,null,null,"Página: 2 de 3"]
["Nº","Aspecto clave de éxito\n (Programa, proyecto, proceso, sistema, entre otros)","Área funcional","Riesgo asociado al aspecto clave de éxito","Zona de riesgo final y/o nivel de aseguramiento","Actividad de control o de aseguramiento ","Soporte documental del control","Responsables de la ejecución","Número de eventos materializados","MONITOREO SEGUNDA LÍNEA DE DEFENSA",null,null,"CRITERIOS EVALUADORES DEL NIVEL DE CONFIANZA DE LA ACTIVIDAD DE CONTROL - TERCERA LINEA DE DEFENSA",null,null,null,null,"NIVEL DE \nCONFIANZA  ","Observaciones por Segunda linea (incluye acciones de plan de mejoramiento asociadas al riesgo)","Observaciones OCI",null,null,"NIVEL DE \nCONFIANZA"]
[null,null,null,null,null,null,null,null,null,"Análisis del avance","Periodo evaluado","¿se materializo el evento?","Objetivo y alcance de la función de aseguramiento\n(20%)","Prácticas y metodología\n(30%)","Ejecución por parte del responsable\n(30%)","Comunicación de resultados \n(20%)","Total"]
[1,"Subsistema de gestión ambiental","Subdirección administrativa y financiera","Posibilidad de daño económico y reputacional por incumplimiento de los lineamientos para la formulación, concertación, implementación, evaluación, control y seguimiento del Plan Institucional de Gestión Ambiental - PIGA, debido a:\n-Desconocimiento de la  normativa e inadecuada interpretación y aplicación de los requisitos\n-Inadecuado manejo de los residuos sólidos ordinarios y peligrosos (segregación, recolección, inventario, disposición final, reporte, entre otros). \nTransporte inadecuado de RESPEL y falta de control de dicha actividad.\n-Incremento en los consumos de agua y energía debido a prácticas inadecuadas","Alto aseguramiento","Seguimiento y presentación de los resultados de  las actividades formuladas en el Plan Institucional de Gestión Ambiental en el comité Institucional de Gestión y Desempeño.","Acta del Comité Institucional  de Gestión y Desempeño","Subdirector(a) Administrativo, Financiero y de Control Interno\nDisciplinario\nContratista Profesional Francy ",0,"Durante el segundo semestre de la vigencia 2022 se han ejecutado las actividades del Plan Institucional de Gestión Ambiental conforme lo programado, resaltando entre otras, el seguimiento a los consumos de agua y energía; la divulgación de tips o practicas sostenibles a través de piezas gráficas; inspección a los puntos hidrosanitarios; elaboración y radicación a la UAESP de informes periódicos; elaboración de los informes periódicos del PIGA y transmisión a través de Storm web; sensibilización sobre plásticos de un sólo uso; actualización del documento PIGA en atención al proceso de concertación de la sede San Luis, del Plan de Gestión Integral de Residuos Peligrosos y del Plan de Acción Interno para el Aprovechamiento de los Residuos (PAI); suscripción del acuerdo de corresponsabilidad para el manejo de los residuos reciclables con la organización Corporación Centro Histórico; actualización del registro de generadores de residuos peligrosos de la entidad mediante la cancelación de registro sede arrecife e inscripción de la sede San Luis; ejecución de acciones de movilidad sostenible: socialización de los días de la movilidad sostenible conforme lo establecido en el Decreto 037 de 2019 \"primer jueves de cada mes\" y reporte de los viajes en bicicleta, gestión para el cumplimiento del incentivo por el uso de la bicicleta para funcionarios públicos y finalización de la implementación del programa Al Trabajo en Bici.\n\nTeniendo en cuenta el traslado de sede, se gestionó con la Secretaría de Ambiente la aprobación del documento PIGA y de sus anexos, lo cual fue avalado a través de correo electrónico el 27 de septiembre, por lo cual, se procedió a radicar el 13 de octubre mediante comunicación oficial.\n\nEn cuanto a consumos de agua y energía eléctrica, se continua con el levantamiento de la línea base para determinar acciones de intervención de ser necesario.  Desde el mes de septiembre se subsano el inconveniente con la medición del consumo de energía y a partir de dicho periodo se ha recibido la facturación con consumos dentro del histórico de la entidad.\n\nLos temas de revisión y aprobación por parte del CIGD han sido presentados y aprobados en los comités No. 13 (observaciones concertación PIGA), No. 17 (Emergencias), No. 20 (socialización PIGA, revisión política ambiental, compra pública sostenible, Plan Integral de Movilidad Sostenible y Día de la Movilidad Sostenible, seguimiento a consumos de agua y energía).\n\nDe igual forma, en los seguimientos trimestrales del Plan de Adecuación y Sostenibilidad del MIPG y de los indicadores de Gestión, los cuales son revisados, consolidados y presentados en el CIGD por la Oficina Asesora de Planeación, se han relacionado los resultados y el cumplimiento de actividades de Gestión Ambiental. \n\nLas acciones adelantadas permiten garantizar el cumplimiento de los lineamientos del PIGA, lo cual se enmarca en los requisitos legales descritos en el normograma del proceso de Gestión de Recursos Físicos y Ambiental. El control se determina eficiente toda vez que el riesgo no se ha materializado.","Segundo semestre","no",5,5,5,5,{"$f":"(M8*0.2)+(N8*0.3)+(O8*0.3)+(P8*0.2)","v":5},{"$f":"IF(Q8<0.9,\" \",IF(Q8<3,\"Bajo Aseguramiento\",IF(Q8<4,\"Medio Aseguramiento\",\"Alto Aseguramiento\")))","v":"Alto Aseguramiento"},null,"Se validó las actas # 13 y 17 de 2022  del Comité Institucional de Gestión y Desempeño que evidencia temas relevantes para aprobación por el mismo, entre ellos las observaciones realizadas por parte de la SDA - Secretaria Distrital de Ambiente sobre el documento PIGA y el plan de acción 2022 el cual fue modificado por cambio de sede de la Entidad, adicionalmente mediante actas #12 y 18 de 2022 del CIGD se realizo socialización por parte de la OAP sobre los resultados de seguimiento trimestral al plan de acción de MIPG - Gestión ambiental, el cual se viene ejecutando oportunamente. Se revisó presentación del Comité Institucional de Gestión y Desempeño sobre socialización del plan Institucional Ambiental, politica ambiental, los consumos agua y energia, entre otros.\n\nEl seguimiento del consumo de agua y energía se validará en el siguiente semestre en razón a que se encuentran estableciendo la linea de los mismos. \nNo se ha reportado materizalización del riesgo por parte de los responsables del proceso.  \n\nSeguimiento efectuado por: María Margarita Cruz Gómez - profesional contratistas OCI\nFecha de verificación: 12/12/2022",null,null,{"$f":"IF(V8<0.9,\" \",IF(V8<3,\"Bajo Aseguramiento\",IF(V8<4,\"Medio Aseguramiento\",\"Alto Aseguramiento\")))","v":" "}]
{"$rows_left_out":6}
{"sheet":"Consolidado controles","index":6,"n_rows":10,"n_cols":7,"rows_kept":10,"cut":false,"hidden":false,"merged":[[0,0,3,1],[0,2,3,4]]}
[null,null,"\nMAPA DE ASEGURAMIENTO IDEP\n",null,null,"Código: ","FT-MIC-03-22"]
[null,null,null,null,null,"Versión:",2]
[null,null,null,null,null,"Fecha aprobación:","2022-04-13"]
[null,null,null,null,null,"Página","3 de 3"]
["No.","Aspecto clave de éxito","Area funcional - Proceso","No Riesgo","No Control","Nivel de confianza controles","Observación OCI"]
[1,"Subsistema de gestión ambiental","Subdirección administrativa y financiera - Recursos fisicos",1,1,"Alto aseguramiento"]
[2,"Subsistema de seguridad y salud en el trabajo.","Subdirección administrativa y financiera - Recursos fisicos",2,1,"Alto aseguramiento"]
[3,"Seguimiento al plan anual de adquisiciones.","Dirección y planeación. \nTodos los procesos.",3,1,"Alto aseguramiento"]
{"$rows_left_out":3}
{"sheet":"Hoja2","index":7,"n_rows":25,"n_cols":10,"rows_kept":25,"cut":false,"hidden":true,"merged":[[6,1,6,6],[13,1,13,6],[20,1,20,6],[2,9,2,14],[3,9,5,14],[3,8,5,8],[6,9,6,14],[8,8,9,8],[10,8,11,8],[8,9,9,14],[10,9,11,14],[12,9,12,14],[7,9,7,14]]}
[]
[]
[null,null,null,null,null,null,null,null,"Bajo Aseguramiento","La Oficina de Control Interno o quien haga sus veces deberá auditar y generar hallazgos y recomendaciones a la función de aseguramiento para su mejora y evaluará los controles de 1ª línea de defensa que corresponderían  a la 2ª línea de defensa."]
[null,null,null,null,null,null,null,null,"Medio Aseguramiento","La Oficina de Control Interno o quien haga sus veces deberá auditar y generar hallazgos y recomendaciones a la función de aseguramiento (2ª línea) para su mejora y evaluará los aspectos que considere relevantes de la 1ª línea de defensa."]
[]
[]
[null,"La Oficina de Control Interno o quien haga sus veces confiará en los resultados del aseguramiento de la 2ª línea y basado en sus informes, auditará la efectividad de dicha función, evitando evaluar los controles de la 1ª línea.\n",null,null,null,null,null,null,"Alto Aseguramiento","La Oficina de Control Interno o quien haga sus veces confiará en los resultados del aseguramiento de la 2ª línea y basado en sus informes, auditará la efectividad de dicha función, evitando evaluar los controles de la 1ª línea."]
[null,null,null,null,null,null,null,null," "," "]
{"$rows_left_out":17}